EOX GitLab Instance

Fixing path of ABC

1 job for restructure-resources in 40 seconds (queued for 6 seconds)
Name Stage Failure
failed
test Test
TOTAL                                    487    259    47%

=========================== short test summary info ============================
FAILED tests/test_main.py::test_stacapi[S2L2A_Element84] - TypeError: __init_...
FAILED tests/test_main.py::test_opensearch[Creodias-Opensearch] - TypeError: ...
FAILED tests/test_main.py::test_s3[Fusion-data] - harvester.exceptions.Harves...
============================== 3 failed in 1.09s ===============================
Cleaning up file based variables
ERROR: Job failed: exit code 1